{"text_format":"1","workbook":"xlsx","n_sheets":5,"sheets":["Order form","Price List","Languages","LangBackup","Setup"],"not_rendered":{"charts":0,"images":1,"macros":1,"external_links":1,"defined_names":8,"comments":0,"pivot_tables":0},"unopened":[],"bounds":{"document_bytes":16777216,"sheet_cells":100000,"rows_first":2000,"rows_last":500,"rows_between":2000,"halvings":0,"cell_chars":16384,"cell_head_chars":4096},"cells_cut":0,"cells_raw":0,"read":"whole","date_system":"1900"}

{"sheet":"Order form","index":0,"n_rows":93,"n_cols":39,"rows_kept":93,"cut":false,"hidden":false,"merged":[[14,18,14,25],[15,1,15,35],[17,1,17,6],[18,1,18,6],[27,16,27,35],[29,16,29,35],[28,16,28,35],[2,30,2,35],[34,16,34,21],[34,22,34,26],[34,27,34,29],[34,30,34,35],[1,12,1,27],[2,12,2,27],[1,6,1,11],[1,30,1,35],[11,5,11,13],[7,5,7,13],[8,5,8,13],[9,5,9,13],[10,5,10,13],[7,28,7,35],[8,28,8,35],[9,28,9,35],[10,28,10,35],[11,28,11,35],[11,18,11,25],[7,18,7,25],[8,18,8,25],[9,18,9,25],[10,18,10,25],[42,16,42,35],[46,16,46,35],[47,16,47,35],[51,16,51,35],[52,16,52,35],[56,16,56,35],[55,16,55,35],[53,16,53,26],[5,5,5,13],[5,18,5,25],[5,28,5,35],[6,5,6,13],[6,18,6,25],[6,28,6,35],[12,5,12,13],[12,28,12,35],[37,16,37,35],[13,5,13,13],[12,18,12,25],[21,16,21,35],[13,18,13,25],[13,28,13,35],[14,5,14,13],[14,28,14,35],[53,27,53,28],[53,29,53,35],[54,16,54,26],[54,27,54,28],[54,29,54,35],[39,16,39,35],[35,16,35,35],[36,16,36,35],[17,7,17,35],[40,16,40,35],[38,16,38,35],[45,16,45,35],[48,16,48,35],[18,7,18,35],[22,16,22,35],[23,16,23,35],[24,16,24,35],[25,16,25,35],[31,16,31,35],[26,16,26,35],[30,16,30,25],[32,16,32,35],[33,16,33,35],[41,16,41,35],[76,16,76,35],[77,16,77,35],[78,16,78,35],[92,25,92,35],[92,11,92,12],[72,16,72,35],[92,13,92,15],[92,7,92,10],[58,16,58,35],[61,16,61,35],[85,1,90,35],[75,16,75,35],[69,16,69,27],[69,30,69,35],[59,16,59,35],[60,16,60,35],[62,16,62,35],[63,16,63,35],[79,16,79,35],[80,16,80,35],[81,16,81,35],[57,16,57,35],[66,16,66,27],[67,16,67,27],[68,16,68,27],[66,30,66,35],[67,30,67,35],[68,30,68,35],[73,16,73,35],[74,16,74,35]]}
["DELTA20210310EN"]
[100,"Language",null,null,null,null,"English",null,null,null,null,null,"DELTA STAIRLIFT",null,null,null,null,null,null,null,null,null,null,null,null,null,null,null,"Date",null,{"$f":"TODAY()","v":"2022-01-24"}]
[110,null,null,null,null,null,null,null,null,null,null,null,"ORDER FORM",null,null,null,null,null,null,null,null,null,null,null,null,null,null,null,"Version",null,"DELTA.LE.2021.A"]
[]
[null,null,null,null,null,null,null,null,null,null,null,null,null,null,"Distributor: (always fill out)",null,null,null,null,null,null,null,null,null,null,null,"Delivery address: (always fill out)"]
[120,"Company:",null,null,null,"Lehner Lifttechnik GmbH",null,null,null,null,null,null,null,null,"Company",null,null,null,null,null,null,null,null,null,null,null,"Company"]
[130,"Name:",null,null,null,"Max Lehner",null,null,null,null,null,null,null,null,"Name:",null,null,null,null,null,null,null,null,null,null,null,"Name:"]
[140,"Adress:",null,null,null,"Salling 8",null,null,null,null,null,null,null,null,"Address",null,null,null,null,null,null,null,null,null,null,null,"Address"]
[150,"Postcode:",null,null,null,"A - 4724",null,null,null,null,null,null,null,null,"Postcode",null,null,null,null,null,null,null,null,null,null,null,"Postcode"]
[160,"City:",null,null,null,"Neukirchen am Walde",null,null,null,null,null,null,null,null,"City",null,null,null,null,null,null,null,null,null,null,null,"City"]
[170,"Country:",null,null,null,"Austria",null,null,null,null,null,null,null,null,"Country",null,null,null,null,null,null,null,null,null,null,null,"Country"]
[180,"Phone no:",null,null,null,"+43 7278 3514-0",null,null,null,null,null,null,null,null,"Telephone",null,null,null,null,null,null,null,null,null,null,null,"Telephone"]
[190,"E-mail:",null,null,null,"office@lehnerlifttechnik.at",null,null,null,null,null,null,null,null,"Email"]
[200,"ID:",null,null,null,"ATU22360601",null,null,null,null,null,null,null,null,"ID:"]
[210,"VAT ID:",null,null,null,"ATU22360601",null,null,null,null,null,null,null,null,"VAT ID:"]
[220,"Pick up address for lifts: Spedition Englmayer, Wiesenstrasse 71, 4600 Wels, Austria"]
[]
[null,"Production no.",null,null,null,null,null,"Order reference name (or number)"]
[230]
[]
[null,"Rail specification"]
[1000,"Installation location",null,null,null,null,null,null,null,null,null,null,null,null,null,null,"Indoor"]
[1010,"Installation side",null,null,null,null,null,null,null,null,null,null,null,null,null,null,"Left"]
[1020,"Rail length in meters rounded",null,null,null,null,null,null,null,null,null,null,null,null,null,null,3]
[1030,"Electricity connection",null,null,null,null,null,null,null,null,null,null,null,null,null,null,"-"]
[]
[null,"General platform specifications"]
[1040,"Excecution",null,null,null,null,null,null,null,null,null,null,null,null,null,null,"Platform + rail cut to length (standard)"]
[1050,"Folding seat",null,null,null,null,null,null,null,null,null,null,null,null,null,null,"Without folding seat"]
[1060,"Loading capacity",null,null,null,null,null,null,null,null,null,null,null,null,null,null,"225 kg"]
[1070,"Platform dimension",null,null,null,null,null,null,null,null,null,null,null,null,null,null,"800 x 1000mm",null,null,null,null,null,null,null,null,null,null,"x",null,"mm"]
[1080,"Folding mechanism",null,null,null,null,null,null,null,null,null,null,null,null,null,null,"Automatic folding of platform"]
[1090,"Loading ramps",null,null,null,null,null,null,null,null,null,null,null,null,null,null,"Upper and lower ramp",null,null,null,null,null,null,null,null,null,null,"RAL:",null,"RAL:",null,null,null,null,null,null,null,null,{"$f":"IF(Q33=\"Upper and front ramp (without lower)\",\"Special option - please consult Lehner before order\", \"\")","v":""}]
[1100,"Special 90° side access ramp (folds up 85°)",null,null,null,null,null,null,null,null,null,null,null,null,null,null,"No (standard)"]
[1110,"Ramps length",null,null,null,null,null,null,null,null,null,null,null,null,null,null,"Upper ramp",null,null,null,null,null,"200mm (standard)",null,null,null,null,"Lower ramp",null,null,"200mm (standard)"]
[1120,"Ramps surface",null,null,null,null,null,null,null,null,null,null,null,null,null,null,"Same colour as platform"]
[1130,"Folding sideboard",null,null,null,null,null,null,null,null,null,null,null,null,null,null,"No (standard)"]
[1140,"Platform control",null,null,null,null,null,null,null,null,null,null,null,null,null,null,"All commands on controls on spiral cable (standard)"]
[1150,"External landing controls (always radio)",null,null,null,null,null,null,null,null,null,null,null,null,null,null,"Remote with membrane keypad (standard)"]
[1160,"Type of key",null,null,null,null,null,null,null,null,null,null,null,null,null,null,"Mini key"]
{"$rows_left_out":54}
{"sheet":"Price List","index":1,"n_rows":60,"n_cols":9,"rows_kept":60,"cut":false,"hidden":true,"merged":[[22,1,32,1],[33,1,37,1],[3,10,3,11],[1,2,1,6],[6,3,6,5],[7,1,10,1],[12,1,21,1],[38,1,42,1],[44,1,47,1],[48,1,55,1],[55,2,55,7],[59,2,59,5]]}
[null,"Price list","SP-DELTA",null,null,null,{"$f":"'Order form'!AE3","v":"DELTA.LE.2021.A"}]
[null,"Order reference name (or number)",{"$f":"'Order form'!H19","v":0}]
[null,"Customer (client):","Lehner Lifttechnik GmbH"]
[null,null,"Salling 8"]
[null,null,"A - 4724"]
[null,null,"Neukirchen am Walde"]
[null,null,"Item",null,null,null,"unit","EUR/unit","Price EUR"]
[null,"Platform price","Basic price for lift with 3m steel rail cut to length",{"$f":"IF(OR(AND('Order form'!Q28=\"Platform + rail cut to length (standard)\",'Order form'!Q68<>\"aluminium (indoor or outdoor)\")),1,)","v":1},null,null,"pc",{"$f":"'[1]Price list'!$C8","v":50},{"$f":"D8*H8","v":50}]
[null,null,"Basic price for lift with 3m aluminium rail cut to length",{"$f":"IF(OR(AND('Order form'!Q28=\"Platform + rail cut to length (standard)\",'Order form'!Q68=\"aluminium (indoor or outdoor)\")),1,)","v":0},null,null,"pc",{"$f":"'[1]Price list'!$C9","v":50},{"$f":"D9*H9","v":0}]
[null,null,"Surcharge for stainless platform",{"$f":"IF(OR('Order form'!Q67=\"stainless 304 + Special RAL\",'Order form'!Q67=\"stainless 316 + Special RAL\"),1,)","v":0},null,null,"pc",{"$f":"'[1]Price list'!$C10","v":50},{"$f":"D10*H10","v":0}]
[null,null,"Surcharge for zinc sprayed platform",{"$f":"IF(OR('Order form'!Q67=\"zinc + RAL 7035 (outdoor standard)\",'Order form'!Q67=\"zinc + Special RAL\"),1,)","v":0},null,null,"pc",{"$f":"'[1]Price list'!$C11","v":50},0]
[null,"Location","Indoor / Outdoor",null,null,null,null,{"$f":"'[1]Price list'!$C12","v":50}]
[null,"Rail","Steel rail cut to length",{"$f":"IF(AND('Order form'!Q24>3,AND(OR('Order form'!Q68=\"RAL 9007 (standard indoor)\",'Order form'!Q68=\"Special RAL\",'Order form'!Q68=\"Stainless 304\",'Order form'!Q68=\"Stainless 316 (special surcharge)\"))),'Order form'!Q24-3,0)","v":0},null,null,"m",{"$f":"'[1]Price list'!$C13","v":50},{"$f":"H13*D13","v":0}]
[null,null,"Aluminium stock rail (in 3m pieces)",{"$f":"IF(AND('Order form'!Q24>3,AND('Order form'!Q68=\"aluminium (indoor or outdoor)\")),'Order form'!Q24-3,0)","v":0},null,null,"m",{"$f":"'[1]Price list'!$C14","v":50},{"$f":"H14*D14","v":0}]
[null,null,"Stainless rail 304 cut to length",{"$f":"IF(AND('Order form'!Q24>0,'Order form'!Q68=\"stainless 304\"),'Order form'!Q24,0)","v":0},null,null,"m",{"$f":"'[1]Price list'!$C15","v":50},0]
[null,null,"Stainless rail 316 cut to length",{"$f":"IF(AND('Order form'!Q24,'Order form'!Q68=\"stainless 316 (special surcharge)\"),'Order form'!Q24,0)","v":0},null,null,"m",{"$f":"'[1]Price list'!$C16","v":50},0]
[null,null,"Color treated pillars (each 0,6 m)",{"$f":"CEILING(E17,1)","v":6},{"$f":"IF(OR('Order form'!Q73=\"on the pillars only\",'Order form'!Q73=\"on the wall + pillars\"),('Order form'!Q24/0.6+1),0)","v":6},null,"pc",{"$f":"'[1]Price list'!$C17","v":50},{"$f":"H17*D17","v":300}]
[null,null,"Surcharge - Fire zinc - pillars (each 0,6 m)",{"$f":"IF(OR('Order form'!Q70=\"zinc + RAL 7035 (outdoor standard)\",'Order form'!Q70=\"zinc + special RAL\",'Order form'!Q70=\"zinc\"),D17,0)","v":0},null,null,"pc",{"$f":"'[1]Price list'!$C18","v":50},{"$f":"H18*D18","v":0}]
[null,null,"Surcharge - Stainless steel pillars (each 0,6 m)",{"$f":"IF(OR('Order form'!Q70=\"stainless 304\",'Order form'!Q70=\"stainless 316 (special surcharge)\"),D17,0)","v":0},null,null,"pc",{"$f":"'[1]Price list'!$C19","v":50},{"$f":"H19*D19","v":0}]
[null,null,"Extra pillars for controls",{"$f":"IF('Order form'!Q42=\"Pillar mounted\",'Order form'!Q41,0)","v":0},null,null,"pc",{"$f":"'[1]Price list'!$C20","v":50},0]
[null,null,"Surcharge - Stainless steel extra pillars for controls",{"$f":"IF(OR('Order form'!Q70=\"stainless 304\",'Order form'!Q70=\"stainless 316 (special surcharge)\"),D20,0)","v":0},null,null,"pc",{"$f":"'[1]Price list'!$C21","v":50},0]
[null,null,"Adjustable slots on pillars",{"$f":"IF('Order form'!Q75=\"yes\",D17,0)","v":6},null,null,"pc",{"$f":"'[1]Price list'!$C22","v":50},{"$f":"H22*D22","v":300}]
[null,"Platform","Automatic folding",{"$f":"IF('Order form'!Q32=\"automatic\",1,0)","v":0},null,null,"pc",{"$f":"'[1]Price list'!$C23","v":50},{"$f":"H23*D23","v":0}]
[null,null,"Non-standard platform dimensions",{"$f":"IF('Order form'!Q31=\"special\",1,0)","v":0},null,null,"pc",{"$f":"'[1]Price list'!$C24","v":50},0]
[null,null,"Platform with front loading ramp",{"$f":"IF(OR('Order form'!Q33=\"Upper and lower ramp + front ramp (90° side access)\",'Order form'!Q33=\"Upper and front (without lower)\"),1,0)","v":0},null,null,"pc",{"$f":"'[1]Price list'!$C25","v":50},{"$f":"H25*D25","v":0}]
[null,null,"Front folding ramp 85o",{"$f":"IF('Order form'!Q34=\"yes\",1,0)","v":0},null,null,"pc",{"$f":"'[1]Price list'!$C26","v":50},{"$f":"H26*D26","v":0}]
[null,null,"Platform without lower loading ramp",{"$f":"IF('Order form'!Q33=\"Upper and front ramp (without lower)\",1,0)","v":0},null,null,"pc",{"$f":"'[1]Price list'!$C27","v":50},{"$f":"H27*D27","v":0}]
[null,null,"Folding sideboard",{"$f":"IF('Order form'!Q37=\"yes\",1,0)","v":0},null,null,"pc",{"$f":"'[1]Price list'!$C28","v":50},0]
[null,null,"The length of loading ramps 300mm",{"$f":"IF('Order form'!W35=\"300mm (special)\",1,(IF('Order form'!AE35=\"300mm (special)\",1,0)))","v":0},null,null,"pc",{"$f":"'[1]Price list'!$C29","v":50},0]
[null,null,"Plastic cover",{"$f":"IF('Order form'!Q52=\"yes\",1,0)","v":0},null,null,"pc",{"$f":"'[1]Price list'!$C30","v":50},{"$f":"H30*D30","v":0}]
[null,null,"Padlock against unfolding of the platform by unauthorized user ",{"$f":"IF('Order form'!Q53=\"yes\",1,0)","v":0},null,null,"pc",{"$f":"'[1]Price list'!$C31","v":50},{"$f":"H31*D31","v":0}]
[null,null,"Folding upholstery seat",{"$f":"IF('Order form'!Q29=\"With upholstery folding seat\",1,0)","v":0},null,null,"pc",{"$f":"'[1]Price list'!$C32","v":50},{"$f":"H32*D32","v":0}]
[null,null,"Folding steel seat",{"$f":"IF('Order form'!Q29=\"With steel folding seat\",1,0)","v":0},null,null,"pc",{"$f":"'[1]Price list'!$C33","v":50},{"$f":"H33*D33","v":0}]
[null,"Rail fillings","Glass fillings between pillars",{"$f":"IF('Order form'!Q54=\"Connex glass\",'Order form'!AB54,0)","v":0},null,null,"pc",{"$f":"'[1]Price list'!$C34","v":50},{"$f":"H34*D34","v":0}]
[null,null,"Perforated metal plates between pillars",{"$f":"IF('Order form'!Q54=\"Perforated metal plates\",'Order form'!AB54,0)","v":0},null,null,"pc",{"$f":"'[1]Price list'!$C35","v":50},0]
[null,null,"Wooden fillings",{"$f":"IF('Order form'!Q54=\"Wooden\",'Order form'!AB54,0)","v":0},null,null,"pc",{"$f":"'[1]Price list'!$C36","v":50},{"$f":"H36*D36","v":0}]
[null,null,"Steel rods between pillars",{"$f":"IF('Order form'!Q54=\"Steel rods\",'Order form'!AB54,0)","v":0},null,null,"pc",{"$f":"'[1]Price list'!$C37","v":50},0]
[null,null,"Stainless steel fillings",{"$f":"IF('Order form'!Q54=\"Stainless steel rods\",'Order form'!AB54,0)","v":0},null,null,"pc",{"$f":"'[1]Price list'!$C38","v":50},0]
[null,"Controls","Radio controls with large push buttons (in compliance with EN 81-40)",{"$f":"IF('Order form'!Q39=\"Big push buttons (special)\",'Order form'!Q41,0)","v":0},null,null,"pc",{"$f":"'[1]Price list'!$C39","v":50},{"$f":"H39*D39","v":0}]
[null,null,"Extra controls (2 pcs included in basic price)",{"$f":"'Order form'!Q41-2","v":0},null,null,"pc",{"$f":"'[1]Price list'!$C40","v":0},0]
{"$rows_left_out":21}
{"sheet":"Languages","index":2,"n_rows":239,"n_cols":6,"rows_kept":239,"cut":false,"hidden":true,"merged":[]}
["Cell","Type","English","Deutsch","French","Español"]
[{"$f":"CELL(\"address\",'Order form'!M2)","v":"'[DELTA_Order form_2022.xlsm]Order form'!$M$2"},"Label","DELTA STAIRLIFT","DELTA PLATTFORMLIFT","DELTA MONTE-ESCALIER","DELTA SALVAESCALERA"]
[{"$f":"CELL(\"address\",'Order form'!M3)","v":"'[DELTA_Order form_2022.xlsm]Order form'!$M$3"},"Label","ORDER FORM","BESTELLFORMULAR","BON DE COMMANDE","FORMULARIO DE PEDIDO"]
[{"$f":"CELL(\"address\",'Order form'!AC2)","v":"'[DELTA_Order form_2022.xlsm]Order form'!$AC$2"},"Label","Date","Datum","Date","Fecha"]
[{"$f":"CELL(\"address\",'Order form'!B2)","v":"'[DELTA_Order form_2022.xlsm]Order form'!$B$2"},"Label","Language","Sprache","La langue","Idioma"]
[{"$f":"CELL(\"address\",'Order form'!AC3)","v":"'[DELTA_Order form_2022.xlsm]Order form'!$AC$3"},"Label","Version","Version","Version","Versión"]
[{"$f":"CELL(\"address\",'Order form'!O5)","v":"'[DELTA_Order form_2022.xlsm]Order form'!$O$5"},"Label","Distributor: (always fill out)","Händler: (immer ausfüllen)","Distributeur:","Distribuidor: (siempre llene)"]
[{"$f":"CELL(\"address\",'Order form'!AA5)","v":"'[DELTA_Order form_2022.xlsm]Order form'!$AA$5"},"Label","Delivery address: (always fill out)","Lieferadresse: (immer ausfüllen)","Adresse de livraison:","Dirección de entrega: (siempre completar)"]
[{"$f":"CELL(\"address\",'Order form'!O6)","v":"'[DELTA_Order form_2022.xlsm]Order form'!$O$6"},"Label","Company","Firma","Société","Empresa"]
[{"$f":"CELL(\"address\",'Order form'!AA6)","v":"'[DELTA_Order form_2022.xlsm]Order form'!$AA$6"},"Label","Company","Firma","Société","Empresa"]
[{"$f":"CELL(\"address\",'Order form'!O8)","v":"'[DELTA_Order form_2022.xlsm]Order form'!$O$8"},"Label","Address","Anschrift","Adresse","Dirección"]
[{"$f":"CELL(\"address\",'Order form'!AA8)","v":"'[DELTA_Order form_2022.xlsm]Order form'!$AA$8"},"Label","Address","Anschrift","Adresse","Dirección"]
[{"$f":"CELL(\"address\",'Order form'!O9)","v":"'[DELTA_Order form_2022.xlsm]Order form'!$O$9"},"Label","Postcode","PLZ","Code postal","Código postal"]
[{"$f":"CELL(\"address\",'Order form'!AA9)","v":"'[DELTA_Order form_2022.xlsm]Order form'!$AA$9"},"Label","Postcode","PLZ","Code postal","Código postal"]
[{"$f":"CELL(\"address\",'Order form'!O10)","v":"'[DELTA_Order form_2022.xlsm]Order form'!$O$10"},"Label","City","Stadt","Ville","Ciudad"]
[{"$f":"CELL(\"address\",'Order form'!AA10)","v":"'[DELTA_Order form_2022.xlsm]Order form'!$AA$10"},"Label","City","Stadt","Ville","Ciudad"]
[{"$f":"CELL(\"address\",'Order form'!O11)","v":"'[DELTA_Order form_2022.xlsm]Order form'!$O$11"},"Label","Country","Land","Le pays","País"]
[{"$f":"CELL(\"address\",'Order form'!AA11)","v":"'[DELTA_Order form_2022.xlsm]Order form'!$AA$11"},"Label","Country","Land","Le pays","País"]
[{"$f":"CELL(\"address\",'Order form'!O12)","v":"'[DELTA_Order form_2022.xlsm]Order form'!$O$12"},"Label","Telephone","Telefon","Téléphone","Teléfono"]
[{"$f":"CELL(\"address\",'Order form'!AA12)","v":"'[DELTA_Order form_2022.xlsm]Order form'!$AA$12"},"Label","Telephone","Telefon","Téléphone","Teléfono"]
[]
[]
[]
[]
[]
[{"$f":"CELL(\"address\",'Order form'!B22)","v":"'[DELTA_Order form_2022.xlsm]Order form'!$B$22"},"Label","Installation location","Installationsort","Lieu d'installation","Ubicación de la instalación"]
[{"$f":"CELL(\"address\",'Order form'!B23)","v":"'[DELTA_Order form_2022.xlsm]Order form'!$B$23"},"Label","Installation side","Montageseite","Côté d'installation","Lado de la instalación"]
[{"$f":"CELL(\"address\",'Order form'!B16)","v":"'[DELTA_Order form_2022.xlsm]Order form'!$B$16"},"Label","Pick up address for lifts: Spedition Englmayer, Wiesenstrasse 71, 4600 Wels, Austria","ABHOLADRESSE: Spedition Englmayer, Wiesenstrasse 71, 4600 Wels, Austria","Adresse de ramassage: Spedition Englmayer, Wiesenstrasse 71, 4600 Wels, Austria","Dirección de recogida de los equipos: Spedition Englmayer, Wiesenstrasse 71, 4600 Wels, Austria"]
[{"$f":"CELL(\"address\",'Order form'!B18)","v":"'[DELTA_Order form_2022.xlsm]Order form'!$B$18"},"Label","Production no.","Produktionsnr.","Num. de production","Producción no."]
[{"$f":"CELL(\"address\",'Order form'!H18)","v":"'[DELTA_Order form_2022.xlsm]Order form'!$H$18"},"Label","Order reference name (or number)","Auftragsreferenz (Name oder Nummer)","Nom de référence de la commande (ou numéro)","Nombre de referencia del pedido (o número)"]
[{"$f":"CELL(\"address\",'Order form'!B21)","v":"'[DELTA_Order form_2022.xlsm]Order form'!$B$21"},"Label","Rail specification","Schienenspezifikation","Spécification de rail","Especificación de la guia"]
[{"$f":"CELL(\"address\",'Order form'!B24)","v":"'[DELTA_Order form_2022.xlsm]Order form'!$B$24"},"Label","Rail length in meters rounded","Schienenlänge (ungefähr in m)","Longueur du rail en mètres arrondis","Longitud de la guia en metros redondeados"]
[{"$f":"CELL(\"address\",'Order form'!B25)","v":"'[DELTA_Order form_2022.xlsm]Order form'!$B$25"},"Label","Electricity connection","Elektroanschluss","Connexion electrique","Conexion electrica"]
[{"$f":"CELL(\"address\",'Order form'!Q22)","v":"'[DELTA_Order form_2022.xlsm]Order form'!$Q$22"},"Dropdown","Indoor","Innen","Intérieur","Interior"]
[{"$f":"CELL(\"address\",'Order form'!Q22)","v":"'[DELTA_Order form_2022.xlsm]Order form'!$Q$22"},"Dropdown","Outdoor","Im Außenbereich","De plein air","Al aire libre"]
[{"$f":"CELL(\"address\",'Order form'!Q23)","v":"'[DELTA_Order form_2022.xlsm]Order form'!$Q$23"},"Dropdown","Left","Links","La gauche","Izquierda"]
[{"$f":"CELL(\"address\",'Order form'!Q23)","v":"'[DELTA_Order form_2022.xlsm]Order form'!$Q$23"},"Dropdown","Right","Rechts","Droite","Derecha"]
[{"$f":"CELL(\"address\",'Order form'!Q25)","v":"'[DELTA_Order form_2022.xlsm]Order form'!$Q$25"},"Dropdown","-","-","-","-"]
[{"$f":"CELL(\"address\",'Order form'!Q25)","v":"'[DELTA_Order form_2022.xlsm]Order form'!$Q$25"},"Dropdown","Upper stop","Untere Haltestelle","Arrêt haut","Parada superior"]
[{"$f":"CELL(\"address\",'Order form'!Q25)","v":"'[DELTA_Order form_2022.xlsm]Order form'!$Q$25"},"Dropdown","Lower stop","Obere Haltestelle","Arrêt bas","Parada inferior"]
{"$rows_left_out":200}
{"sheet":"LangBackup","index":3,"n_rows":164,"n_cols":5,"rows_kept":164,"cut":false,"hidden":true,"merged":[]}
["Cell","Type","English","Deutsch","French"]
["Q3","Label","ALPHA stairlift","Alpha Treppenlift"]
["Q4","Label","Order form","Bestellformular","Bon de commande"]
["D3","Label","Dimension No.","Abmessung Nr.","Numéro de dimension"]
["D5","Label","Language","Sprache","La langue"]
["AD3","Label","Date:","Datum:","l' date"]
["AD4","Label","Version:","Version:","Version"]
["P6","Label","Distributor: (always fill out)","Händler: (immer ausfüllen)","Distributeur: (remplissez toujours)"]
["AB6","Label","Delivery address: (always fill out)","Lieferadresse: (immer ausfüllen)","Adresse de livraison: (remplissez toujours)"]
["P7","Label","Company:","Firma:","Enterprise"]
["B7","Label","Company:","Firma:","Enterprise"]
["P9","Label","Address","Anschrift","Une robe"]
["AB9","Label","Address","Anschrift","Une robe"]
["P10","Label","Postcode","Postleitzahl","Code postal"]
["AB10","Label","Postcode","Postleitzahl","Code postal"]
["P11","Label","City","Stadt","Ville"]
["AB11","Label","City","Stadt","Ville"]
["P12","Label","Country","Land","le pays"]
["AB12","Label","Country","Land","le pays"]
["D23","Label","Installation location","Installationsort"]
["D24","Label","Installation side","Montageseite","Côté d'installation"]
["C17","Label","Pick up address for lifts: Spedition Englmayer, Wiesenstrasse 71, 4600 Wels, Austria","ABHOLADRESSE: Spedition Englmayer, Wiesenstrasse 71, 4600 Wels, Austria"]
["C19","Label","Production No.","Produktionsnummer"]
["I19","Label","Order reference name (or number)","Auftragsreferenz (Name oder Nummer)"]
["C22","Label","Rail specification","Schienenspezifikation"]
["D25","Label","Rail length in meters rounded","Schienenlänge (ungefähr in m)","Longueur du rail en mètres arrondis"]
["D26","Label","Lower stop","Untere Haltestelle","Arrêt inférieur"]
["D27","Label","Upper stop","Obere Haltestelle","Arrêt supérieur"]
["D28","Label","Number of 90° curves","Anzahl der 90° Kurven","Nombre de courbes à 90°"]
["D28","Label","Number of 180° curves","Anzahl der 180° Kurven","Nombre de courbes à 180°"]
["D30","Label","Number of special curves","Anzahl der Spezialkurven","Nombre de courbes spéciales"]
["D31","Label","Number of negative curves","Anzahl der Negativkurven"]
["D32","Label","Number of vertical bends","Number of vertical bends"]
["D33","Label","Number of intermediate stops","Anzahl der Zwischenhaltestellen"]
["D34","Label","Rail surface treatment","Schienenfarbe"]
["AD26","Formula","=IF(R26=\"straight start with bottom overrun\",\"mm from first step to end of chair\", \"\")","=IF(R26=\"Gerade mit horizontalem Auslauf\",\"mm von erster Stufe bis Ende Sitz\", \"\")"]
["AD27","Formula","=IF(R27=\"straight top overrun\",\"mm from last step to end of chair\", \"\")","=IF(R27=\"Gerader Überlauf\",\"mm von letzter Stufe bis Ende Sitz\", \"\")"]
["R23","Dropdown","Indoor","Innen"]
["R23","Dropdown","Outdoor","Im Außenbereich"]
["R24","Dropdown","Left","Links","La gauche"]
{"$rows_left_out":125}
{"sheet":"Setup","index":4,"n_rows":1,"n_cols":2,"rows_kept":1,"cut":false,"hidden":true,"merged":[]}
["Language","English"]